{"text_format":"1","workbook":"xlsx","n_sheets":8,"sheets":["Leaderboard","February","March","July & August","September","October","Ten Point Table","Jokers"],"not_rendered":{"charts":0,"images":6,"macros":1,"external_links":0,"defined_names":0,"comments":0,"pivot_tables":0},"unopened":[],"bounds":{"document_bytes":16777216,"sheet_cells":100000,"rows_first":2000,"rows_last":500,"rows_between":2000,"halvings":0,"cell_chars":16384,"cell_head_chars":4096},"cells_cut":0,"cells_raw":0,"read":"whole","date_system":"1900"}

{"sheet":"Leaderboard","index":0,"n_rows":54,"n_cols":9,"rows_kept":54,"cut":false,"hidden":false,"merged":[]}
[]
[]
[]
[]
["No.","Name","Team Name","2020-02-01","2020-03-01","2020-08-01","2020-09-01","2020-10-01","Total Pts"]
[1,"Joseph Kavanagh","Joey's Invincibles",{"$f":"HLOOKUP(B6,February!$I$1:$BE$52,52,FALSE)","v":94},{"$f":"HLOOKUP(B6,March!$I$1:$BE$40,40,FALSE)","v":26},{"$f":"HLOOKUP(B6,'July & August'!$I$1:$BE$58,58,FALSE)","v":88},{"$f":"HLOOKUP(B6,September!$I$1:$BE$42,42,FALSE)","v":77},{"$f":"HLOOKUP(B6,October!$I$1:$BE$48,48,FALSE)","v":17},{"$f":"SUM(D6:H6)","v":302}]
[2,"Andy Dunne","Ballymore Shamrocks",{"$f":"HLOOKUP(B7,February!$I$1:$BE$52,52,FALSE)","v":74},{"$f":"HLOOKUP(B7,March!$I$1:$BE$40,40,FALSE)","v":35},{"$f":"HLOOKUP(B7,'July & August'!$I$1:$BE$58,58,FALSE)","v":71},{"$f":"HLOOKUP(B7,September!$I$1:$BE$42,42,FALSE)","v":103},{"$f":"HLOOKUP(B7,October!$I$1:$BE$48,48,FALSE)","v":15},{"$f":"SUM(D7:H7)","v":298}]
[3,"Keith Ryan","Wearethewanderers",{"$f":"HLOOKUP(B8,February!$I$1:$BE$52,52,FALSE)","v":79},{"$f":"HLOOKUP(B8,March!$I$1:$BE$40,40,FALSE)","v":23},{"$f":"HLOOKUP(B8,'July & August'!$I$1:$BE$58,58,FALSE)","v":95},{"$f":"HLOOKUP(B8,September!$I$1:$BE$42,42,FALSE)","v":59},{"$f":"HLOOKUP(B8,October!$I$1:$BE$48,48,FALSE)","v":22},{"$f":"SUM(D8:H8)","v":278}]
[4,"Gary Donnelly","Cabinteely II",{"$f":"HLOOKUP(B9,February!$I$1:$BE$52,52,FALSE)","v":61},{"$f":"HLOOKUP(B9,March!$I$1:$BE$40,40,FALSE)","v":26},{"$f":"HLOOKUP(B9,'July & August'!$I$1:$BE$58,58,FALSE)","v":86},{"$f":"HLOOKUP(B9,September!$I$1:$BE$42,42,FALSE)","v":84},{"$f":"HLOOKUP(B9,October!$I$1:$BE$48,48,FALSE)","v":15},{"$f":"SUM(D9:H9)","v":272}]
[5,"Joe Turner","The Dairymen of Stradbrook",{"$f":"HLOOKUP(B10,February!$I$1:$BE$52,52,FALSE)","v":89},{"$f":"HLOOKUP(B10,March!$I$1:$BE$40,40,FALSE)","v":26},{"$f":"HLOOKUP(B10,'July & August'!$I$1:$BE$58,58,FALSE)","v":68},{"$f":"HLOOKUP(B10,September!$I$1:$BE$42,42,FALSE)","v":77},{"$f":"HLOOKUP(B10,October!$I$1:$BE$48,48,FALSE)","v":12},{"$f":"SUM(D10:H10)","v":272}]
{"$rows_left_out":45}
{"sheet":"February","index":1,"n_rows":54,"n_cols":57,"rows_kept":54,"cut":false,"hidden":false,"merged":[[1,2,1,5]]}
[null,null,null,null,null,null,null,null,"Aidan Scanlon","Alan Doyle","Andy Dunne","Breifne Earley","Callum Dunne","Caroline Carroll","Chris Hinchey","Ciaran O'Hart","Darragh Kenny","David Miley","David Moran","Davy Doyle","Dean Fletcher","Derek Kelly","Derek McDonald","Eamon Fox","Eoghan Brophy","Eoghan Farrelly","Fiachra O'Brolachain","Gary Donnelly","Gary Keating","Gary Fitzpatrick","Gary McGurk","Gearoid McIntyre","Gerry Draper","Gerry Moore","Graeme Buckley","Hugh Keller","Ian O'Reilly","Jay Thomas","Joe Behan","Joe Turner","John Brophy","Joseph Kavanagh","Josh Tobin","Keith Ryan","Kieran Harnett","Mark Welsh","Niall Carroll","Patrick Dempsey","Paul Moore","Richard Johnston","Seamus McGowan","Sean Keller","Sean O'Mairtin","Sean Taylor","Tom Keane","Tommy Hamill","Trevor Rankin"]
["Day","Date","Teams",null,null,null,"Time"]
["Fri","2020-02-14","Cork City",0,1,"Shelbourne","19:45:00",null,5,0,0,0,0,0,0,0,5,0,5,0,0,0,0,0,0,0,0,0,10,0,0,10,0,5,0,0,0,5,0,0,5,10,0,5,0,"-",0,0,0,0,0,0,0,5,"-",0,0]
["Fri","2020-02-14","Dundalk",1,0,"Derry City","19:45:00",null,5,5,5,5,5,10,5,5,5,5,5,5,5,5,5,5,5,5,5,5,5,5,5,5,5,0,5,5,5,0,5,5,5,5,5,5,5,"-",10,5,5,5,5,5,5,5,"-",5,5]
["Fri","2020-02-14","St Patrick's Athletic",0,1,"Waterford","19:45:00",null,0,0,5,0,0,0,0,0,0,0,0,0,0,0,0,0,0,0,0,0,0,0,0,0,0,0,0,0,0,0,0,0,0,0,0,0,0,"-",0,0,0,0,0,0,0,0,"-",0,0]
["Fri","2020-02-14","Finn Harps",1,0,"Sligo Rovers","20:00:00",null,0,0,5,5,0,0,5,10,5,0,0,0,0,10,0,0,0,0,0,0,0,5,0,0,0,0,0,5,0,0,0,10,0,0,0,0,10,"-",10,0,0,5,0,0,10,0,"-",0,0]
["Sat","2020-02-15","Bohemians",0,1,"Shamrock Rovers","14:00:00",null,5,5,5,0,0,5,5,0,5,0,0,5,5,10,0,10,0,5,5,5,0,0,0,0,0,5,5,0,5,5,0,0,5,5,10,5,0,"-",0,0,0,5,0,0,0,0,5,0,0]
["Fri","2020-02-21","Derry City",1,1,"Finn Harps","19:45:00",null,0,10,0,0,0,0,0,0,0,0,0,0,0,0,0,0,10,0,0,0,0,0,0,10,10,0,0,0,0,0,0,0,0,0,0,0,0,0,0,0,10,0,0,0,0,0,0,0,0]
["Fri","2020-02-21","Shelbourne",1,2,"Dundalk","19:45:00",null,10,10,10,0,10,10,5,0,10,10,10,5,5,5,0,5,5,5,5,0,5,10,5,5,0,5,0,0,10,5,5,5,0,5,5,5,5,5,5,5,5,5,5,5,10,5,10,5,10]
["Fri","2020-02-21","Sligo Rovers",0,2,"St Patrick's Athletic","19:45:00",null,5,0,5,0,0,0,10,0,0,0,0,5,5,5,0,5,5,5,0,0,0,0,0,5,0,5,0,0,0,0,0,0,5,5,0,0,10,0,0,0,0,0,0,0,5,0,0,0,0]
{"$rows_left_out":45}
{"sheet":"March","index":2,"n_rows":42,"n_cols":57,"rows_kept":42,"cut":false,"hidden":false,"merged":[[1,2,1,5]]}
[null,null,null,null,null,null,null,null,"Aidan Scanlon","Alan Doyle","Andy Dunne","Breifne Earley","Callum Dunne","Caroline Carroll","Chris Hinchey","Ciaran O'Hart","Darragh Kenny","David Miley","David Moran","Davy Doyle","Dean Fletcher","Derek Kelly","Derek McDonald","Eamon Fox","Eoghan Brophy","Eoghan Farrelly","Fiachra O'Brolachain","Gary Donnelly","Gary Keating","Gary Fitzpatrick","Gary McGurk","Gearoid McIntyre","Gerry Draper","Gerry Moore","Graeme Buckley","Hugh Keller","Ian O'Reilly","Jay Thomas","Joe Behan","Joe Turner","John Brophy","Joseph Kavanagh","Josh Tobin","Keith Ryan","Kieran Harnett","Mark Welsh","Niall Carroll","Patrick Dempsey","Paul Moore","Richard Johnston","Seamus McGowan","Sean Keller","Sean O'Mairtin","Sean Taylor","Tom Keane","Tommy Hamill","Trevor Rankin"]
["Day","Date","Teams",null,null,null,"Time"]
["Fri","2020-03-06","St Patrick's Athletic",1,0,"Cork City","19:45:00",null,5,0,0,5,5,5,5,5,5,5,0,5,5,5,5,5,5,5,5,5,5,5,0,0,5,10,10,"-",5,5,5,5,0,5,5,5,5,10,5,5,5,5,5,0,10,5,5,10,5]
["Fri","2020-03-06","Waterford",2,1,"Derry City","19:45:00",null,0,0,10,0,0,0,0,0,0,0,0,0,0,0,0,0,0,0,0,0,0,0,5,10,0,0,0,"-",10,0,0,0,5,0,0,0,0,0,5,5,0,10,10,0,0,0,0,0,0]
["Fri","2020-03-06","Bohemians",2,0,"Shelbourne","20:00:00",null,0,5,5,0,5,0,5,0,0,0,5,0,0,5,0,5,5,10,0,5,5,0,10,5,0,0,0,"-",5,0,5,5,0,5,0,0,0,0,5,5,5,5,5,0,5,0,5,5,0]
["Fri","2020-03-06","Finn Harps",0,4,"Dundalk","20:00:00",null,5,5,5,5,5,5,5,5,5,5,10,10,5,5,5,5,5,5,5,5,5,5,5,5,5,5,5,"-",0,5,5,5,5,5,5,5,5,5,5,0,5,0,0,5,5,5,5,5,5]
["Sat","2020-03-07","Sligo Rovers",2,3,"Shamrock Rovers","19:45:00",null,5,5,5,5,5,5,5,5,5,5,0,5,5,5,5,5,5,5,5,5,0,5,5,5,5,0,0,"-",0,5,5,5,5,5,5,5,5,5,5,0,5,5,0,5,5,5,5,5,5]
[]
["Goalscorers"]
["Aaron Greene - Shamrock Rovers",null,null,{"$f":"COUNT(H10:DK10)","v":26},{"$f":"1","v":1},null,null,null,null,{"$f":"2*$E10","v":2},{"$f":"2*$E10","v":2},null,null,null,null,{"$f":"2*$E10","v":2},{"$f":"2*$E10","v":2},null,null,{"$f":"2*$E10","v":2},null,null,{"$f":"2*$E10","v":2},null,null,{"$f":"2*$E10","v":2},{"$f":"2*$E10","v":2},null,{"$f":"2*$E10","v":2},null,{"$f":"2*$E10","v":2},{"$f":"2*$E10","v":2},{"$f":"2*$E10","v":2},null,{"$f":"2*$E10","v":2},null,{"$f":"2*$E10","v":2},{"$f":"2*$E10","v":2},null,{"$f":"2*$E10","v":2},null,{"$f":"2*$E10","v":2},null,{"$f":"2*$E10","v":2},null,{"$f":"2*$E10","v":2},{"$f":"2*$E10","v":2},null,{"$f":"2*$E10","v":2},null,null,{"$f":"2*$E10","v":2},null,{"$f":"2*$E10","v":2},{"$f":"2*$E10","v":2},{"$f":"2*$E10","v":2},{"$f":"2*$E10","v":2}]
{"$rows_left_out":33}
{"sheet":"July & August","index":3,"n_rows":60,"n_cols":57,"rows_kept":60,"cut":false,"hidden":false,"merged":[[1,2,1,5]]}
[null,null,null,null,null,null,null,null,"Aidan Scanlon","Alan Doyle","Andy Dunne","Breifne Earley","Callum Dunne","Caroline Carroll","Chris Hinchey","Ciaran O'Hart","Darragh Kenny","David Miley","David Moran","Davy Doyle","Dean Fletcher","Derek Kelly","Derek McDonald","Eamon Fox","Eoghan Brophy","Eoghan Farrelly","Fiachra O'Brolachain","Gary Donnelly","Gary Keating","Gary Fitzpatrick","Gary McGurk","Gearoid McIntyre","Gerry Draper","Gerry Moore","Graeme Buckley","Hugh Keller","Ian O'Reilly","Jay Thomas","Joe Behan","Joe Turner","John Brophy","Joseph Kavanagh","Josh Tobin","Keith Ryan","Kieran Harnett","Mark Welsh","Niall Carroll","Patrick Dempsey","Paul Moore","Richard Johnston","Seamus McGowan","Sean Keller","Sean O'Mairtin","Sean Taylor","Tom Keane","Tommy Hamill","Trevor Rankin"]
["Day","Date","Teams",null,null,null,"Time"]
["Fri","2020-07-31","Derry City",0,2,"Sligo Rovers","17:45:00",null,0,0,0,0,0,0,0,0,0,0,0,0,0,0,0,0,0,0,0,0,0,0,0,0,0,0,0,"-",0,0,0,0,0,0,0,0,0,0,0,0,0,0,0,5,0,0,0,0,0]
["Fri","2020-07-31","Dundalk",1,1,"St Patrick's Athletic","19:45:00",null,5,0,0,0,0,0,0,0,0,0,0,0,0,0,0,0,0,0,0,10,0,0,0,0,0,0,0,"-",0,0,0,0,0,10,0,0,0,0,0,0,0,0,0,0,0,0,0,0,0]
["Sat","2020-08-01","Shelbourne",0,1,"Waterford","14:00:00",null,5,0,5,0,0,5,0,0,0,0,0,0,0,0,0,0,0,0,0,0,0,0,0,0,0,0,0,"-",0,0,0,0,0,0,0,0,0,0,0,0,0,0,0,5,0,0,0,0,0]
["Sat","2020-08-01","Shamrock Rovers",3,1,"Finn Harps","17:00:00",null,5,5,5,5,5,5,5,5,5,5,5,10,5,5,10,5,5,5,5,5,5,5,5,5,5,5,5,"-",5,5,5,5,5,5,5,5,5,5,5,10,5,5,5,0,5,5,5,5,5]
["Sun","2020-08-02","Cork City",0,1,"Bohemians","17:00:00",null,0,0,0,5,0,0,5,0,10,5,0,5,5,5,5,10,5,5,5,5,5,0,0,10,5,5,10,"-",0,0,5,0,0,10,10,5,0,10,0,0,10,5,0,5,5,10,5,10,0]
["Mon","2020-08-03","St Patrick's Athletic",0,2,"Derry City","19:45:00",null,0,5,0,0,0,0,0,0,0,0,0,5,0,0,0,0,5,0,0,0,0,0,0,5,0,0,0,"-",0,0,0,0,0,0,0,0,0,5,0,0,0,0,0,5,0,0,0,0,0]
["Tue","2020-08-04","Finn Harps",0,1,"Shelbourne","17:45:00",null,0,0,0,0,0,0,5,0,0,5,0,10,0,0,5,0,0,0,0,0,0,0,10,0,0,10,10,"-",0,5,0,0,5,0,10,10,5,10,0,0,0,0,"-",5,0,0,10,0,0]
["Fri","2020-08-07","Bohemians",2,1,"Dundalk","17:45:00",null,0,0,0,5,10,0,5,0,0,0,10,0,0,0,10,0,0,0,0,0,10,0,5,0,0,10,0,"-",10,0,0,0,0,0,0,0,0,0,0,5,0,10,"-",0,0,0,0,0,0]
{"$rows_left_out":51}
{"sheet":"September","index":4,"n_rows":44,"n_cols":57,"rows_kept":44,"cut":false,"hidden":false,"merged":[[1,2,1,5]]}
[null,null,null,null,null,null,null,null,"Aidan Scanlon","Alan Doyle","Andy Dunne","Breifne Earley","Callum Dunne","Caroline Carroll","Chris Hinchey","Ciaran O'Hart","Darragh Kenny","David Miley","David Moran","Davy Doyle","Dean Fletcher","Derek Kelly","Derek McDonald","Eamon Fox","Eoghan Brophy","Eoghan Farrelly","Fiachra O'Brolachain","Gary Donnelly","Gary Keating","Gary Fitzpatrick","Gary McGurk","Gearoid McIntyre","Gerry Draper","Gerry Moore","Graeme Buckley","Hugh Keller","Ian O'Reilly","Jay Thomas","Joe Behan","Joe Turner","John Brophy","Joseph Kavanagh","Josh Tobin","Keith Ryan","Kieran Harnett","Mark Welsh","Niall Carroll","Patrick Dempsey","Paul Moore","Richard Johnston","Seamus McGowan","Sean Keller","Sean O'Mairtin","Sean Taylor","Tom Keane","Tommy Hamill","Trevor Rankin"]
["Day","Date","Teams",null,null,null,"Time"]
["Fri","2020-09-04","Waterford",3,0,"St Patrick's Athletic","19:45:00",null,0,5,5,"-","-",0,0,0,5,5,5,0,0,0,0,0,0,5,0,5,0,0,5,5,5,0,0,"-","-",0,0,5,0,0,0,0,5,0,0,"-",0,0,"-","-",5,0,0,0,5]
["Sat","2020-09-05","Shamrock Rovers",1,0,"Bohemians","14:00:00",null,5,0,5,"-","-",10,0,5,5,0,5,5,5,0,5,10,5,10,5,0,0,0,0,0,0,0,0,"-","-",10,0,10,0,10,0,5,"-",10,0,"-",5,0,"-","-",5,0,5,0,5]
["Sat","2020-09-05","Shelbourne",1,1,"Cork City","17:00:00",null,0,5,10,"-","-",0,0,0,0,0,0,0,0,0,0,0,0,0,5,10,5,10,0,0,0,0,0,"-","-",0,0,0,0,0,0,0,"-",0,0,"-",0,0,"-","-",0,10,10,0,0]
["Mon","2020-09-07","Sligo Rovers",3,1,"Finn Harps","19:45:00",null,0,10,5,"-","-",5,5,0,5,5,"-",10,5,5,0,5,5,5,0,5,10,5,5,0,5,5,5,"-","-",5,5,5,5,5,5,0,"-",5,5,"-",5,0,"-","-",5,0,5,5,5]
["Fri","2020-09-11","Bohemians",0,2,"Waterford","17:45:00",null,0,0,0,"-","-",0,0,0,0,0,"-",0,0,0,0,0,0,0,0,0,0,0,0,0,0,0,0,"-","-",0,0,0,0,0,5,0,"-",0,0,"-",0,"-","-","-",0,0,0,0,0]
["Fri","2020-09-11","Dundalk",3,2,"Shelbourne","20:00:00",null,0,5,5,"-","-",5,5,0,0,5,"-",5,5,5,5,5,5,5,0,5,5,5,5,5,5,0,5,"-","-",5,0,5,5,5,0,5,"-",5,5,"-",5,"-","-","-",5,5,5,5,5]
["Sat","2020-09-12","Cork City",0,3,"Shamrock Rovers","14:00:00",null,5,5,5,"-","-",5,5,0,5,5,"-",5,5,5,0,5,10,5,5,5,0,5,5,0,5,0,5,"-","-",5,10,5,0,5,5,5,"-",5,10,"-",5,"-","-","-",5,10,5,5,5]
["Sat","2020-09-12","St Patrick's Athletic",0,0,"Sligo Rovers","17:00:00",null,0,0,10,"-","-",0,0,5,0,0,"-",5,5,5,0,0,0,0,0,0,0,0,5,0,10,0,0,"-","-",0,0,5,0,0,0,5,"-",0,5,"-",5,"-","-","-",5,0,0,5,5]
{"$rows_left_out":35}
{"sheet":"October","index":5,"n_rows":50,"n_cols":57,"rows_kept":50,"cut":false,"hidden":false,"merged":[[1,2,1,5]]}
[null,null,null,null,null,null,null,null,"Aidan Scanlon","Alan Doyle","Andy Dunne","Breifne Earley","Callum Dunne","Caroline Carroll","Chris Hinchey","Ciaran O'Hart","Darragh Kenny","David Miley","David Moran","Davy Doyle","Dean Fletcher","Derek Kelly","Derek McDonald","Eamon Fox","Eoghan Brophy","Eoghan Farrelly","Fiachra O'Brolachain","Gary Donnelly","Gary Keating","Gary Fitzpatrick","Gary McGurk","Gearoid McIntyre","Gerry Draper","Gerry Moore","Graeme Buckley","Hugh Keller","Ian O'Reilly","Jay Thomas","Joe Behan","Joe Turner","John Brophy","Joseph Kavanagh","Josh Tobin","Keith Ryan","Kieran Harnett","Mark Welsh","Niall Carroll","Patrick Dempsey","Paul Moore","Richard Johnston","Seamus McGowan","Sean Keller","Sean O'Mairtin","Sean Taylor","Tom Keane","Tommy Hamill","Trevor Rankin"]
["Day","Date","Teams",null,null,null,"Time"]
["Fri","2020-10-02","Derry City",2,0,"Waterford","17:45:00",null,0,0,5,"-","-",10,0,0,0,5,"-",0,5,0,10,5,0,"-",0,0,0,0,5,5,0,5,5,"-","-",0,10,0,0,0,0,0,"-",0,5,"-",10,"-","-","-",10,0,0,5,0]
["Fri","2010-10-02","Shamrock Rovers",4,0,"Sligo Rovers","19:45:00",null,5,5,5,"-",5,5,5,5,5,5,"-",5,5,5,5,5,5,"-",5,5,5,5,5,5,5,5,0,"-","-",5,5,5,5,5,5,5,"-",5,5,"-",5,5,"-","-",5,5,5,5,5]
["Sat","2010-10-03","Cork City",1,2,"St Patrick's Athletic","17:00:00",null,5,0,0,"-",0,10,0,0,0,0,"-",5,0,0,10,5,5,"-",0,0,5,0,10,0,0,0,5,"-","-",0,5,0,10,5,0,10,"-",5,0,"-",10,0,"-","-",10,0,0,0,0]
["Sat","2010-10-03","Shelbourne",1,3,"Bohemians","19:30:00",null,0,0,5,"-",5,5,5,0,5,5,"-",5,5,5,0,5,5,"-",5,5,5,5,5,5,5,0,5,"-","-",5,0,5,5,5,0,5,"-",0,5,"-",0,5,"-","-",5,5,5,5,5]
["Sun","2020-10-04","Dundalk",0,0,"Finn Harps","17:00:00",null,0,0,0,"-",0,0,0,0,0,0,"-",0,0,0,0,0,0,"-",5,5,0,0,0,0,0,0,0,"-","-",0,0,0,0,0,0,0,"-",0,0,"-",0,0,"-","-",0,0,0,0,0]
["Fri","2020-10-09","Bohemians",null,null,"Cork City","17:45:00"]
["Fri","2020-10-09","St Patrick's Athletic",null,null,"Dundalk","19:45:00"]
["Sat","2020-10-10","Waterford",null,null,"Shelbourne","17:00:00"]
{"$rows_left_out":41}
{"sheet":"Ten Point Table","index":6,"n_rows":51,"n_cols":9,"rows_kept":51,"cut":false,"hidden":false,"merged":[]}
[]
["No.","Name","Team Name","2020-02-01","2020-03-01","2020-08-01","2020-09-01","2020-10-01","Total"]
[1,"Joseph Kavanagh","Joey's Invincibles",{"$f":"HLOOKUP(B3,February!$I$1:$BE$54,54,FALSE)","v":4},{"$f":"HLOOKUP(B3,March!$I$1:$BE$42,42,FALSE)","v":0},{"$f":"HLOOKUP(B3,'July & August'!$I$1:$BE$60,60,FALSE)","v":6},{"$f":"HLOOKUP(B3,September!$I$1:$BE$44,44,FALSE)","v":2},{"$f":"HLOOKUP(B3,October!$I$1:$BE$50,50,FALSE)","v":0},{"$f":"SUM(D3:H3)","v":12}]
[2,"Caroline Carroll","Tarzan's 11",{"$f":"HLOOKUP(B4,February!$I$1:$BE$54,54,FALSE)","v":6},{"$f":"HLOOKUP(B4,March!$I$1:$BE$42,42,FALSE)","v":0},{"$f":"HLOOKUP(B4,'July & August'!$I$1:$BE$60,60,FALSE)","v":1},{"$f":"HLOOKUP(B4,September!$I$1:$BE$44,44,FALSE)","v":1},{"$f":"HLOOKUP(B4,October!$I$1:$BE$50,50,FALSE)","v":2},{"$f":"SUM(D4:H4)","v":10}]
[3,"Eamon Fox","Culchies United",{"$f":"HLOOKUP(B5,February!$I$1:$BE$54,54,FALSE)","v":4},{"$f":"HLOOKUP(B5,March!$I$1:$BE$42,42,FALSE)","v":0},{"$f":"HLOOKUP(B5,'July & August'!$I$1:$BE$60,60,FALSE)","v":3},{"$f":"HLOOKUP(B5,September!$I$1:$BE$44,44,FALSE)","v":3},{"$f":"HLOOKUP(B5,October!$I$1:$BE$50,50,FALSE)","v":0},{"$f":"SUM(D5:H5)","v":10}]
[4,"Gary Fitzpatrick","Cabo Ultra's",{"$f":"HLOOKUP(B6,February!$I$1:$BE$54,54,FALSE)","v":4},{"$f":"HLOOKUP(B6,March!$I$1:$BE$42,42,FALSE)","v":0},{"$f":"HLOOKUP(B6,'July & August'!$I$1:$BE$60,60,FALSE)","v":3},{"$f":"HLOOKUP(B6,September!$I$1:$BE$44,44,FALSE)","v":3},{"$f":"HLOOKUP(B6,October!$I$1:$BE$50,50,FALSE)","v":0},{"$f":"SUM(D6:H6)","v":10}]
[5,"Graeme Buckley","Canyoneroes",{"$f":"HLOOKUP(B7,February!$I$1:$BE$54,54,FALSE)","v":0},{"$f":"HLOOKUP(B7,March!$I$1:$BE$42,42,FALSE)","v":1},{"$f":"HLOOKUP(B7,'July & August'!$I$1:$BE$60,60,FALSE)","v":7},{"$f":"HLOOKUP(B7,September!$I$1:$BE$44,44,FALSE)","v":2},{"$f":"HLOOKUP(B7,October!$I$1:$BE$50,50,FALSE)","v":0},{"$f":"SUM(D7:H7)","v":10}]
[6,"Joe Turner","The Dairymen of Stradbrook",{"$f":"HLOOKUP(B8,February!$I$1:$BE$54,54,FALSE)","v":4},{"$f":"HLOOKUP(B8,March!$I$1:$BE$42,42,FALSE)","v":0},{"$f":"HLOOKUP(B8,'July & August'!$I$1:$BE$60,60,FALSE)","v":3},{"$f":"HLOOKUP(B8,September!$I$1:$BE$44,44,FALSE)","v":3},{"$f":"HLOOKUP(B8,October!$I$1:$BE$50,50,FALSE)","v":0},{"$f":"SUM(D8:H8)","v":10}]
[7,"Tom Keane","Hoopshoops",{"$f":"HLOOKUP(B9,February!$I$1:$BE$54,54,FALSE)","v":3},{"$f":"HLOOKUP(B9,March!$I$1:$BE$42,42,FALSE)","v":0},{"$f":"HLOOKUP(B9,'July & August'!$I$1:$BE$60,60,FALSE)","v":4},{"$f":"HLOOKUP(B9,September!$I$1:$BE$44,44,FALSE)","v":3},{"$f":"HLOOKUP(B9,October!$I$1:$BE$50,50,FALSE)","v":0},{"$f":"SUM(D9:H9)","v":10}]
[8,"Alan Doyle","Shamrock Ravers",{"$f":"HLOOKUP(B10,February!$I$1:$BE$54,54,FALSE)","v":3},{"$f":"HLOOKUP(B10,March!$I$1:$BE$42,42,FALSE)","v":0},{"$f":"HLOOKUP(B10,'July & August'!$I$1:$BE$60,60,FALSE)","v":3},{"$f":"HLOOKUP(B10,September!$I$1:$BE$44,44,FALSE)","v":3},{"$f":"HLOOKUP(B10,October!$I$1:$BE$50,50,FALSE)","v":0},{"$f":"SUM(D10:H10)","v":9}]
{"$rows_left_out":42}
{"sheet":"Jokers","index":7,"n_rows":50,"n_cols":20,"rows_kept":50,"cut":false,"hidden":false,"merged":[]}
["No.","Player","Team Name","Joker",1,2,3,4,5,6,7,8,9,10,11,12,13,14,15,"Total"]
[1,"Aidan Scanlon","Kilflynn Santos","2-0","a",null,null,null,null,null,null,null,null,null,null,null,null,null,null,{"$f":"COUNTIF(E2:S2,\"a\")","v":1}]
[2,"Alan Doyle","Shamrock Ravers",null,null,null,null,null,null,null,null,null,null,null,null,null,null,null,null,0]
[3,"Andy Dunne","Ballymore Shamrocks","2-1","a","a","a",null,null,null,null,null,null,null,null,null,null,null,null,3]
[4,"Breifne Earley","Leitrim Villa","2-0","a","a","a","a","a","a","a","a","a","a","a","a","a","a","a",15]
[5,"Callum Dunne","Derry Girls","2-1","a","a","a","a","a","a","a","a","a","a","a","a","a","a","a",15]
[6,"Caroline Carroll","Tarzan's 11","2-0","a","a","a","a",null,null,null,null,null,null,null,null,null,null,null,4]
[7,"Chris Hinchey","Lilywhites","2-0","a","a","a","a","a","a","a","a","a","a","a","a","a","a","a",15]
[8,"Ciaran O'Hart","Riverchapel Plate","1-1","a","a","a","a","a",null,null,null,null,null,null,null,null,null,null,5]
[9,"Darragh Kenny","Luca Connell CSC",null,null,null,null,null,null,null,null,null,null,null,null,null,null,null,null,0]
{"$rows_left_out":40}